{"text_format":"1","workbook":"xlsx","n_sheets":11,"sheets":["A-Assignment Worksheet","I-Inputs","C-Attachment To Assignment","D-Attachment Payments","B-Block Ticket"," E- Internal Payments","F - Payoff","D-Checklist","N - Payment Histories","SDA Instructions","C-Stream Advance"],"not_rendered":{"charts":0,"images":8,"macros":1,"external_links":0,"defined_names":20,"comments":0,"pivot_tables":0},"unopened":[],"bounds":{"document_bytes":16777216,"sheet_cells":100000,"rows_first":2000,"rows_last":500,"rows_between":2000,"halvings":0,"cell_chars":16384,"cell_head_chars":4096},"cells_cut":0,"cells_raw":0,"read":"whole","date_system":"1900"}

{"sheet":"A-Assignment Worksheet","index":0,"n_rows":36,"n_cols":12,"rows_kept":36,"cut":false,"hidden":false,"merged":[[3,6,3,7],[4,6,4,7],[5,6,5,7],[6,6,6,7],[2,3,2,4],[2,0,2,2],[4,0,4,2],[5,0,5,2],[6,0,6,2],[5,3,5,4],[6,3,6,4],[3,3,3,4],[4,3,4,4]]}
["SDA STREAM ASSIGNMENT WORKSHEET",null,null,null,null,null,null,null,null,null,null,"Send completed worksheet to Cash@SDAinc.net"]
["(Attachment to Assignment)",null,null,null,null,null,null,null,null,null,null,"Call 404-352-9936 for assistance."]
["Dealer Name:",null,null,null,null,null,null,null,null,"Payment Types:"]
[null,null,"Address:",null,null,"City:",null,null,null,"W - Weekly"]
["State:",null,null,null,null,"ZIP:",null,null,null,"B - BiWeekly"]
["Phone:",null,null,null,null,"Email:",null,null,null,"M - Monthly"]
["Fax:",null,null,null,null,"Date:",null,null,null,"S - Semimonthly"]
[]
[null,"Payment Type","Date SOLD to Customer","# of Payments Remaining","Payment Amount","Next Payment Due Date","Car Year","Make","Model","Last Name","First Name","Current Loan Balance"]
["EX","M","2017-12-15",36,175,"2018-01-15",2011,"Chevy","Malibu","Smith","David",9525]
{"$rows_left_out":27}
{"sheet":"I-Inputs","index":1,"n_rows":31,"n_cols":4,"rows_kept":31,"cut":false,"hidden":true,"merged":[[1,0,1,2]]}
["STREAM Model Inputs"]
["Notes:\nRed Text is a variable to be completed by SDA Only.\nBlue Text is input comleted by Dealers.\nAll Black text is a formula and is automatically calculated."]
[]
["Dealer Inputs",null,"Notes","RCR Defaults"]
["Dealership Name:",{"$f":"+'A-Assignment Worksheet'!D3","v":0},"Copied from Dealer Completed Form","Dealer Default"]
["State:",{"$f":"+'A-Assignment Worksheet'!D5","v":0},"Determines Checklist Requirements"]
["Batch #:",1]
["Batch ID:","18F2"]
["Branch ID:","Stream1"]
["Pkg No:"]
{"$rows_left_out":22}
{"sheet":"C-Attachment To Assignment","index":2,"n_rows":43,"n_cols":14,"rows_kept":43,"cut":false,"hidden":true,"merged":[[2,0,2,2],[4,0,4,2],[5,0,5,2],[6,0,6,2],[3,3,3,5],[4,3,4,5],[5,3,5,5],[6,3,6,5],[2,3,2,5]]}
["ATTACHMENT TO ASSIGNMENT DATED:",null,null,null,null,null,{"$f":"+'I-Inputs'!B11","v":"2018-05-21"}]
[]
["Dealership Name:",null,null,{"$f":"+'A-Assignment Worksheet'!D3","v":0},null,null,null,"Batch #:",{"$f":"+'I-Inputs'!B7","v":1}]
[null,null,"Address:",{"$f":"+'A-Assignment Worksheet'!D4","v":0}]
["City:",null,null,{"$f":"+'A-Assignment Worksheet'!G4","v":0},null,null,null,"State:",{"$f":"+'A-Assignment Worksheet'!D5","v":0}]
["Phone:",null,null,{"$f":"+'A-Assignment Worksheet'!D6","v":0},null,null,null,"Zip:",{"$f":"+'A-Assignment Worksheet'!G5","v":0}]
["Fax:",null,null,{"$f":"+'A-Assignment Worksheet'!D7","v":0},null,null,null,"Email:",{"$f":"+'A-Assignment Worksheet'!G6","v":0}]
[]
[]
[null,"Last Name","First Name","Car Year","Make","Model","Payment","Payments Year","Stream Advance Amount","Title Escrow Fee"]
{"$rows_left_out":34}
{"sheet":"D-Attachment Payments","index":3,"n_rows":141,"n_cols":7,"rows_kept":141,"cut":false,"hidden":true,"merged":[]}
["ATTACHMENT TO ASSIGNMENT DATED:",null,null,{"$f":"+'I-Inputs'!B11","v":"2018-05-21"},null,null,{"$f":"+'C-Stream Advance'!C43+1","v":53}]
["Payment Schedule"]
["Dealer Name:",{"$f":"+'A-Assignment Worksheet'!D3","v":0},null,"Batch #:",{"$f":"+'I-Inputs'!B7","v":1}]
["Address:",{"$f":"+'A-Assignment Worksheet'!D4","v":0}]
["City:",{"$f":"+'A-Assignment Worksheet'!G4","v":0},null,"Phone:",{"$f":"+'A-Assignment Worksheet'!D6","v":0}]
["State:",{"$f":"+'A-Assignment Worksheet'!D5","v":0},null,"Fax:",{"$f":"+'A-Assignment Worksheet'!D7","v":0}]
["Zip:",{"$f":"+'A-Assignment Worksheet'!G5","v":0},null,"Email:",{"$f":"IF('A-Assignment Worksheet'!D3>0,+'A-Assignment Worksheet'!G6,\"\")","v":""}]
[]
[]
["Scheduled Due Dates","Payment Number","Payment Amount","Date Paid","Amount ACH'd"]
{"$rows_left_out":132}
{"sheet":"B-Block Ticket","index":4,"n_rows":45,"n_cols":24,"rows_kept":45,"cut":false,"hidden":true,"merged":[[38,10,38,11],[39,10,39,11],[40,10,40,11],[41,10,41,11],[42,10,42,11],[6,2,6,3],[6,10,6,11],[7,2,7,3],[7,5,7,6],[7,9,7,11],[7,13,7,16],[7,21,7,22],[8,7,8,9],[8,10,9,10],[8,14,8,22],[4,2,4,3],[4,5,4,6],[4,13,4,16],[5,2,5,3],[5,5,5,6],[5,9,5,11],[5,13,5,16],[2,2,2,3],[2,5,2,6],[2,13,2,16],[2,17,2,18],[3,2,3,3],[3,5,3,6],[3,13,3,16]]}
["SDA BLOCK TICKET   (INTERNAL USE ONLY)",null,null,null,null,null,null,null,null,null,null,null,null,"SDA Payments in Stream Analysis"]
[]
[null,"Dealer Name:",{"$f":"+'A-Assignment Worksheet'!D3","v":0},null,"Batch #:",{"$f":"+'I-Inputs'!B7","v":1},null,null,null,null,null,null,null,"Dealership Name:",null,null,null,{"$f":"+'A-Assignment Worksheet'!D3","v":0},null,"Payment Type Multiplier"]
[null,"Address:",{"$f":"+'A-Assignment Worksheet'!D4","v":0},null,"City:",{"$f":"+'A-Assignment Worksheet'!G4","v":0},null,null,null,null,null,null,null,"Days in Stream;",null,null,null,{"$f":"+'I-Inputs'!B21","v":365},null,"W",4.3330000000000002,7]
[null,"State:",{"$f":"+'A-Assignment Worksheet'!D5","v":0},null,"ZIP:",{"$f":"+'A-Assignment Worksheet'!G5","v":0},null,null,null,null,null,null,null,"Months in Stream;",null,null,null,{"$f":"+'I-Inputs'!B16","v":12},null,"B",2.1659999999999999,14]
[null,"Phone:",{"$f":"+'A-Assignment Worksheet'!D6","v":0},null,"Email:",{"$f":"+'A-Assignment Worksheet'!G6","v":0},null,null,null,null,null,null,null,"Batch Payment Frequency:",null,null,null,"W",null,"M",4.3330000000000002,30]
[null,"Fax:",{"$f":"+'A-Assignment Worksheet'!D7","v":0},null,"Batch ID:",{"$f":"+'I-Inputs'!B8","v":"18F2"},null,null,null,"Date:",{"$f":"+'I-Inputs'!B11","v":"2018-05-21"},null,null,null,null,null,"Payments in Stream:",{"$f":"+$R$5*(VLOOKUP($R$6,T4:V7,2,FALSE))","v":51.996000000000002},null,"S",2,15]
[]
[null,null,null,null,null,null,null,"Payments in Stream",null,null,"Stream Advance Amount",null,null,null,"PAYMENTS IN STREAM ANALYSIS"]
["#","Last Name","First Name","Year","Make","Principal Balance","Payment","No.","Amount","Last Payment",null,"Capital Ratio",null,null,"Next Payment Date","Payment Type","Multiplier","Payments in Year","Max Days in Stream","Days Account is in Stream","Days Between Payments","Payments in Stream","Weekly Payments"]
{"$rows_left_out":36}
{"sheet":" E- Internal Payments","index":5,"n_rows":144,"n_cols":5,"rows_kept":144,"cut":false,"hidden":true,"merged":[[9,2,9,3],[10,2,10,3],[3,2,3,3],[4,2,4,3],[5,2,5,3],[6,2,6,3],[7,2,7,3],[8,2,8,3]]}
["PAYMENT/ACH SCHEDULE"]
["Internal use Only"]
["Stream Payment Terms:"]
["Dealer Name:",{"$f":"+'A-Assignment Worksheet'!D3","v":0},"Batch #:",null,{"$f":"+'I-Inputs'!B7","v":1}]
["Stream Months:",{"$f":"+'I-Inputs'!B16","v":12},"Stream Advancement Amount:",null,{"$f":"+'B-Block Ticket'!G39","v":0}]
["Stream Percentage:",{"$f":"+'I-Inputs'!B17","v":0.8},"Less Administrative Cost:",null,{"$f":"+'B-Block Ticket'!G40","v":-10}]
["Payment Type:",{"$f":"+'I-Inputs'!B18","v":"W"},"Less Payoff:",null,{"$f":"+'B-Block Ticket'!G41","v":-100}]
["First Payment Date:",{"$f":"+'I-Inputs'!B19","v":"2018-05-24"},"Less Title Escrow:",null,{"$f":"+'B-Block Ticket'!G42","v":0}]
["Payments in Stream:",{"$f":"+'B-Block Ticket'!C43","v":52},"Less Wire Fee:",null,{"$f":"+'B-Block Ticket'!G43","v":-30}]
["Payment Amount:",{"$f":"+'B-Block Ticket'!C44","v":0},"Total to Be Deducted:",null,{"$f":"+'B-Block Ticket'!G44","v":-140}]
{"$rows_left_out":135}
{"sheet":"F - Payoff","index":6,"n_rows":45,"n_cols":11,"rows_kept":45,"cut":false,"hidden":true,"merged":[[8,1,9,1],[8,8,8,10],[6,3,6,4],[7,3,7,4],[7,6,7,7],[4,3,4,4],[4,6,4,7],[5,3,5,4],[5,6,5,7],[2,3,2,4],[2,6,2,7],[3,3,3,4],[3,6,3,7]]}
["PAYOFF CALCULATION  (Internal Use Only)"]
[]
[null,null,"Dealer Name:",{"$f":"+'A-Assignment Worksheet'!D3","v":0},null,"Batch #:",{"$f":"+'I-Inputs'!B7","v":1}]
[null,null,"Last Payment Completed:","2018-06-15"]
[null,null,"Last Payment in Batch:",{"$f":"+'I-Inputs'!B20","v":"2019-05-24"}]
[null,null,"Batch Payments Remaining:",{"$f":"(DATEDIF(D4+'I-Inputs'!B31,D5,\"D\"))/'I-Inputs'!B31","v":48}]
[null,null,"Total Payments in Batch:",{"$f":"+'B-Block Ticket'!R7","v":51.996000000000002},null,null,null,null,null,"Today's Date:",{"$f":"TODAY()","v":"2018-10-02"}]
[]
[null,"Select Account (1)",null,null,null,null,null,null,"Payments Remaining"]
["#",null,"Last Name","First Name","Year","Make","Principal Balance","Payment","Payments Made","Payments Remaining","Payoff Amount"]
{"$rows_left_out":36}
{"sheet":"D-Checklist","index":7,"n_rows":34,"n_cols":18,"rows_kept":34,"cut":false,"hidden":true,"merged":[[2,11,2,12],[6,7,6,8],[7,7,7,8],[2,3,2,4],[3,3,3,4],[4,3,4,4],[5,3,5,4],[6,3,6,4],[2,6,2,7],[3,6,3,7],[4,6,4,7],[5,6,5,7]]}
[null,"SDA Account Checklist - INTERNAL USE ONLY"]
[]
[null,null,"Dealer Name:",{"$f":"+'A-Assignment Worksheet'!D3:E3","v":0},null,"City:",{"$f":"+'A-Assignment Worksheet'!G4:H4","v":0},null,null,null,"Batch #:",{"$f":"+'I-Inputs'!B7","v":1}]
[null,null,"Address:",{"$f":"+'A-Assignment Worksheet'!D4:E4","v":0},null,"ZIP:",{"$f":"+'A-Assignment Worksheet'!G5:H5","v":0}]
[null,null,"State:",{"$f":"+'A-Assignment Worksheet'!D5:E5","v":0},null,"Email:",{"$f":"+'A-Assignment Worksheet'!G6:H6","v":0}]
[null,null,"Phone:",{"$f":"+'A-Assignment Worksheet'!D6:E6","v":0},null,"Date:",{"$f":"+'A-Assignment Worksheet'!G7:H7","v":0}]
[null,null,"Fax:",{"$f":"+'A-Assignment Worksheet'!D7:E7","v":0}]
[]
[null,"Last Name","First Name","Car Year","Make","Model"," Original Title or Title Receipt","Original Sales Contract","Original Bill of Sale","Power of Attorney","Original Arbitration Agreement","GPS Disclosure Form","Customer Application","License or Social Security Card","Payment History of Account","Privacy Statement","Notes"]
[1,{"$f":"+'A-Assignment Worksheet'!J11","v":0},{"$f":"+'A-Assignment Worksheet'!K11","v":0},{"$f":"+'A-Assignment Worksheet'!G11","v":0},{"$f":"+'A-Assignment Worksheet'!H11","v":0},{"$f":"+'A-Assignment Worksheet'!I11","v":0},null,null,null,null,null,null,null,0,null,0,0,{"$f":"SUM(G10:N10)","v":0}]
{"$rows_left_out":25}
{"sheet":"N - Payment Histories","index":8,"n_rows":35,"n_cols":136,"rows_kept":35,"cut":false,"hidden":true,"merged":[[6,0,6,2],[8,0,8,5],[4,6,4,8],[5,6,5,8],[2,0,2,2],[4,0,4,2],[4,4,4,5],[5,0,5,2]]}
["Payment Histories Worksheet"]
[]
["Dealership Name:",null,null,{"$f":"+'A-Assignment Worksheet'!D3","v":0},null,null,null,null,"Batch #:",{"$f":"+'I-Inputs'!B7","v":1}]
[null,null,"Address:",{"$f":"+'A-Assignment Worksheet'!D4","v":0},null,null,null,null,"City:",{"$f":"+'A-Assignment Worksheet'!G4","v":0}]
["State:",null,null,{"$f":"+'A-Assignment Worksheet'!D5","v":0},null,null,"First payment Date:",null,null,{"$f":"+'I-Inputs'!B30","v":"2018-05-24"}]
["Phone:",null,null,{"$f":"+'A-Assignment Worksheet'!D6","v":0},null,null,"Payment Frequency:",null,null,{"$f":"+'I-Inputs'!$B$31","v":7}]
["Fax:",null,null,{"$f":"+'A-Assignment Worksheet'!D7","v":0}]
[]
[null,null,null,null,null,null,1,2,3,4,5,6,7,8,9,10,11,12,13,14,15,16,17,18,19,20,21,22,23,24,25,26,27,28,29,30,31,32,33,34,35,36,37,38,39,40,41,42,43,44,45,46,47,48,49,50,51,52,53,54,55,56,57,58,59,60,61,62,63,64,65,66,67,68,69,70,71,72,73,74,75,76,77,78,79,80,81,82,83,84,85,86,87,88,89,90,91,92,93,94,95,96,97,98,99,100,101,102,103,104,105,106,107,108,109,110,111,112,113,114,115,116,117,118,119,120,121,122,123,124,125,126,127,128,129,130]
[null,"Last Name","First Name","Car Year","Make","Model",{"$f":"+'I-Inputs'!$B$30","v":"2018-05-24"},{"$f":"+G10+'I-Inputs'!$B$31","v":"2018-05-31"},{"$f":"+H10+'I-Inputs'!$B$31","v":"2018-06-07"},{"$f":"+I10+'I-Inputs'!$B$31","v":"2018-06-14"},{"$f":"+J10+'I-Inputs'!$B$31","v":"2018-06-21"},{"$f":"+K10+'I-Inputs'!$B$31","v":"2018-06-28"},{"$f":"+L10+'I-Inputs'!$B$31","v":"2018-07-05"},{"$f":"+M10+'I-Inputs'!$B$31","v":"2018-07-12"},{"$f":"+N10+'I-Inputs'!$B$31","v":"2018-07-19"},{"$f":"+O10+'I-Inputs'!$B$31","v":"2018-07-26"},{"$f":"+P10+'I-Inputs'!$B$31","v":"2018-08-02"},{"$f":"+Q10+'I-Inputs'!$B$31","v":"2018-08-09"},{"$f":"+R10+'I-Inputs'!$B$31","v":"2018-08-16"},{"$f":"+S10+'I-Inputs'!$B$31","v":"2018-08-23"},{"$f":"+T10+'I-Inputs'!$B$31","v":"2018-08-30"},{"$f":"+U10+'I-Inputs'!$B$31","v":"2018-09-06"},{"$f":"+V10+'I-Inputs'!$B$31","v":"2018-09-13"},{"$f":"+W10+'I-Inputs'!$B$31","v":"2018-09-20"},{"$f":"+X10+'I-Inputs'!$B$31","v":"2018-09-27"},{"$f":"+Y10+'I-Inputs'!$B$31","v":"2018-10-04"},{"$f":"+Z10+'I-Inputs'!$B$31","v":"2018-10-11"},{"$f":"+AA10+'I-Inputs'!$B$31","v":"2018-10-18"},{"$f":"+AB10+'I-Inputs'!$B$31","v":"2018-10-25"},{"$f":"+AC10+'I-Inputs'!$B$31","v":"2018-11-01"},{"$f":"+AD10+'I-Inputs'!$B$31","v":"2018-11-08"},{"$f":"+AE10+'I-Inputs'!$B$31","v":"2018-11-15"},{"$f":"+AF10+'I-Inputs'!$B$31","v":"2018-11-22"},{"$f":"+AG10+'I-Inputs'!$B$31","v":"2018-11-29"},{"$f":"+AH10+'I-Inputs'!$B$31","v":"2018-12-06"},{"$f":"+AI10+'I-Inputs'!$B$31","v":"2018-12-13"},{"$f":"+AJ10+'I-Inputs'!$B$31","v":"2018-12-20"},{"$f":"+AK10+'I-Inputs'!$B$31","v":"2018-12-27"},{"$f":"+AL10+'I-Inputs'!$B$31","v":"2019-01-03"},{"$f":"+AM10+'I-Inputs'!$B$31","v":"2019-01-10"},{"$f":"+AN10+'I-Inputs'!$B$31","v":"2019-01-17"},{"$f":"+AO10+'I-Inputs'!$B$31","v":"2019-01-24"},{"$f":"+AP10+'I-Inputs'!$B$31","v":"2019-01-31"},{"$f":"+AQ10+'I-Inputs'!$B$31","v":"2019-02-07"},{"$f":"+AR10+'I-Inputs'!$B$31","v":"2019-02-14"},{"$f":"+AS10+'I-Inputs'!$B$31","v":"2019-02-21"},{"$f":"+AT10+'I-Inputs'!$B$31","v":"2019-02-28"},{"$f":"+AU10+'I-Inputs'!$B$31","v":"2019-03-07"},{"$f":"+AV10+'I-Inputs'!$B$31","v":"2019-03-14"},{"$f":"+AW10+'I-Inputs'!$B$31","v":"2019-03-21"},{"$f":"+AX10+'I-Inputs'!$B$31","v":"2019-03-28"},{"$f":"+AY10+'I-Inputs'!$B$31","v":"2019-04-04"},{"$f":"+AZ10+'I-Inputs'!$B$31","v":"2019-04-11"},{"$f":"+BA10+'I-Inputs'!$B$31","v":"2019-04-18"},{"$f":"+BB10+'I-Inputs'!$B$31","v":"2019-04-25"},{"$f":"+BC10+'I-Inputs'!$B$31","v":"2019-05-02"},{"$f":"+BD10+'I-Inputs'!$B$31","v":"2019-05-09"},{"$f":"+BE10+'I-Inputs'!$B$31","v":"2019-05-16"},{"$f":"+BF10+'I-Inputs'!$B$31","v":"2019-05-23"},{"$f":"+BG10+'I-Inputs'!$B$31","v":"2019-05-30"},{"$f":"+BH10+'I-Inputs'!$B$31","v":"2019-06-06"},{"$f":"+BI10+'I-Inputs'!$B$31","v":"2019-06-13"},{"$f":"+BJ10+'I-Inputs'!$B$31","v":"2019-06-20"},{"$f":"+BK10+'I-Inputs'!$B$31","v":"2019-06-27"},{"$f":"+BL10+'I-Inputs'!$B$31","v":"2019-07-04"},{"$f":"+BM10+'I-Inputs'!$B$31","v":"2019-07-11"},{"$f":"+BN10+'I-Inputs'!$B$31","v":"2019-07-18"},{"$f":"+BO10+'I-Inputs'!$B$31","v":"2019-07-25"},{"$f":"+BP10+'I-Inputs'!$B$31","v":"2019-08-01"},{"$f":"+BQ10+'I-Inputs'!$B$31","v":"2019-08-08"},{"$f":"+BR10+'I-Inputs'!$B$31","v":"2019-08-15"},{"$f":"+BS10+'I-Inputs'!$B$31","v":"2019-08-22"},{"$f":"+BT10+'I-Inputs'!$B$31","v":"2019-08-29"},{"$f":"+BU10+'I-Inputs'!$B$31","v":"2019-09-05"},{"$f":"+BV10+'I-Inputs'!$B$31","v":"2019-09-12"},{"$f":"+BW10+'I-Inputs'!$B$31","v":"2019-09-19"},{"$f":"+BX10+'I-Inputs'!$B$31","v":"2019-09-26"},{"$f":"+BY10+'I-Inputs'!$B$31","v":"2019-10-03"},{"$f":"+BZ10+'I-Inputs'!$B$31","v":"2019-10-10"},{"$f":"+CA10+'I-Inputs'!$B$31","v":"2019-10-17"},{"$f":"+CB10+'I-Inputs'!$B$31","v":"2019-10-24"},{"$f":"+CC10+'I-Inputs'!$B$31","v":"2019-10-31"},{"$f":"+CD10+'I-Inputs'!$B$31","v":"2019-11-07"},{"$f":"+CE10+'I-Inputs'!$B$31","v":"2019-11-14"},{"$f":"+CF10+'I-Inputs'!$B$31","v":"2019-11-21"},{"$f":"+CG10+'I-Inputs'!$B$31","v":"2019-11-28"},{"$f":"+CH10+'I-Inputs'!$B$31","v":"2019-12-05"},{"$f":"+CI10+'I-Inputs'!$B$31","v":"2019-12-12"},{"$f":"+CJ10+'I-Inputs'!$B$31","v":"2019-12-19"},{"$f":"+CK10+'I-Inputs'!$B$31","v":"2019-12-26"},{"$f":"+CL10+'I-Inputs'!$B$31","v":"2020-01-02"},{"$f":"+CM10+'I-Inputs'!$B$31","v":"2020-01-09"},{"$f":"+CN10+'I-Inputs'!$B$31","v":"2020-01-16"},{"$f":"+CO10+'I-Inputs'!$B$31","v":"2020-01-23"},{"$f":"+CP10+'I-Inputs'!$B$31","v":"2020-01-30"},{"$f":"+CQ10+'I-Inputs'!$B$31","v":"2020-02-06"},{"$f":"+CR10+'I-Inputs'!$B$31","v":"2020-02-13"},{"$f":"+CS10+'I-Inputs'!$B$31","v":"2020-02-20"},{"$f":"+CT10+'I-Inputs'!$B$31","v":"2020-02-27"},{"$f":"+CU10+'I-Inputs'!$B$31","v":"2020-03-05"},{"$f":"+CV10+'I-Inputs'!$B$31","v":"2020-03-12"},{"$f":"+CW10+'I-Inputs'!$B$31","v":"2020-03-19"},{"$f":"+CX10+'I-Inputs'!$B$31","v":"2020-03-26"},{"$f":"+CY10+'I-Inputs'!$B$31","v":"2020-04-02"},{"$f":"+CZ10+'I-Inputs'!$B$31","v":"2020-04-09"},{"$f":"+DA10+'I-Inputs'!$B$31","v":"2020-04-16"},{"$f":"+DB10+'I-Inputs'!$B$31","v":"2020-04-23"},{"$f":"+DC10+'I-Inputs'!$B$31","v":"2020-04-30"},{"$f":"+DD10+'I-Inputs'!$B$31","v":"2020-05-07"},{"$f":"+DE10+'I-Inputs'!$B$31","v":"2020-05-14"},{"$f":"+DF10+'I-Inputs'!$B$31","v":"2020-05-21"},{"$f":"+DG10+'I-Inputs'!$B$31","v":"2020-05-28"},{"$f":"+DH10+'I-Inputs'!$B$31","v":"2020-06-04"},{"$f":"+DI10+'I-Inputs'!$B$31","v":"2020-06-11"},{"$f":"+DJ10+'I-Inputs'!$B$31","v":"2020-06-18"},{"$f":"+DK10+'I-Inputs'!$B$31","v":"2020-06-25"},{"$f":"+DL10+'I-Inputs'!$B$31","v":"2020-07-02"},{"$f":"+DM10+'I-Inputs'!$B$31","v":"2020-07-09"},{"$f":"+DN10+'I-Inputs'!$B$31","v":"2020-07-16"},{"$f":"+DO10+'I-Inputs'!$B$31","v":"2020-07-23"},{"$f":"+DP10+'I-Inputs'!$B$31","v":"2020-07-30"},{"$f":"+DQ10+'I-Inputs'!$B$31","v":"2020-08-06"},{"$f":"+DR10+'I-Inputs'!$B$31","v":"2020-08-13"},{"$f":"+DS10+'I-Inputs'!$B$31","v":"2020-08-20"},{"$f":"+DT10+'I-Inputs'!$B$31","v":"2020-08-27"},{"$f":"+DU10+'I-Inputs'!$B$31","v":"2020-09-03"},{"$f":"+DV10+'I-Inputs'!$B$31","v":"2020-09-10"},{"$f":"+DW10+'I-Inputs'!$B$31","v":"2020-09-17"},{"$f":"+DX10+'I-Inputs'!$B$31","v":"2020-09-24"},{"$f":"+DY10+'I-Inputs'!$B$31","v":"2020-10-01"},{"$f":"+DZ10+'I-Inputs'!$B$31","v":"2020-10-08"},{"$f":"+EA10+'I-Inputs'!$B$31","v":"2020-10-15"},{"$f":"+EB10+'I-Inputs'!$B$31","v":"2020-10-22"},{"$f":"+EC10+'I-Inputs'!$B$31","v":"2020-10-29"},{"$f":"+ED10+'I-Inputs'!$B$31","v":"2020-11-05"},{"$f":"+EE10+'I-Inputs'!$B$31","v":"2020-11-12"}]
{"$rows_left_out":26}
{"sheet":"SDA Instructions","index":9,"n_rows":49,"n_cols":4,"rows_kept":49,"cut":false,"hidden":true,"merged":[]}
["Instructions for RCR Program"]
["SDA Instructions:"]
["Steps","Instructions","Responsibility","Notes"]
[1,"Salesman and SDA team will jointly decide when it is time to send the PHASE 1 materials for the RCR Program.","Sales Team and Margaret","Send Cover Sheet, Program Details"]
[2,"Follow normal SDA Dealer application procedures for any NEW dealers.","Sales Team and Margaret","Use Same Dealer Application Process"]
[3,"If Dealer has never completed an RCR batch previously, they must complete a new Dealer Agreement and associated Addendum.  Documents to be sent to dealer (via email) should include:\n- RCR Cover Letter\n- RCR Dealer Agreement\n- Addendum A Updatede with Negotiated Terms from Loan Committee\n- Assignment Agreement\n- Irrevocable Power of Attorney\n- Guaranty and Indemnity Agreement\n- Purchase Affirmation with Updated Batch Number\n- Certificate of Authority\n- DMS and GPS Contract Addendum\n- Title Escrow Agreement\n","Margaret, Anddrea, or Kevin","Templates are located in RCR Folder in Shared Drive"]
[4,"If Dealer is a returning RCR customer, only send the RCR Electronic Worksheet as described below.","SDA Team","Send \"RCR Assignment Worksheet: from RCR Folder on Shared Drive."]
[5,"When appropriate, send the RCR Electronic Worksheet and ask Dealer to complete the Assignment Worksheet Tab.  Verify that all other tabs are hidden.","SDA Team","Send \"RCR Assignment Worksheet: from RCR Folder on Shared Drive."]
[6,"Dealer can contact either Sales Team or Margaret, Andrea, or Kevin for assistance.","Sales Team and Margaret"]
[7,"Dealer should send completed worksheet to Cash@sdainc.net.","Dealer","Margaret, Kevin and Alecia all receive this email.   Only Margaret will manage unless out of the office."]
{"$rows_left_out":40}
{"sheet":"C-Stream Advance","index":10,"n_rows":45,"n_cols":30,"rows_kept":45,"cut":false,"hidden":true,"merged":[[8,12,8,13],[2,7,2,8],[3,7,3,8],[4,7,4,8],[5,7,5,8],[6,7,6,8],[8,11,9,11],[8,16,8,24],[2,19,2,20],[2,2,2,3],[3,2,3,3],[4,2,4,3],[7,10,7,12],[2,15,2,18],[8,8,8,10],[5,2,5,3],[7,2,7,3],[7,15,7,18],[7,23,7,24],[3,15,3,18],[4,15,4,18],[5,15,5,18],[6,2,6,3]]}
["SDA STREAM ADVANCE REQUEST",null,null,null,null,null,null,null,null,null,null,null,null,null,null,"SDA Payments in Stream Analysis"]
[]
[null,"Dealer Name:",{"$f":"+'A-Assignment Worksheet'!D3","v":0},null,null,null,"Batch #:",{"$f":"+'I-Inputs'!B7","v":1},null,null,null,null,null,null,null,"Dealership Name:",null,null,null,{"$f":"+'A-Assignment Worksheet'!D3","v":0},null,"Payment Type","Multiplier","Days in Period","Payments in Stream"]
[null,"Address:",{"$f":"+'A-Assignment Worksheet'!D4","v":0},null,null,null,"City:",{"$f":"+'A-Assignment Worksheet'!G4","v":0},null,null,null,null,null,null,null,"Days in Stream;",null,null,null,{"$f":"+'I-Inputs'!B21","v":365},null,"W",4.3330000000000002,7,{"$f":"ROUND(+W4*$T$5,0)","v":52}]
[null,"State:",{"$f":"+'A-Assignment Worksheet'!D5","v":0},null,null,null,"ZIP:",{"$f":"+'A-Assignment Worksheet'!G5","v":0},null,null,null,null,null,null,null,"Months in Stream;",null,null,null,{"$f":"+'I-Inputs'!B16","v":12},null,"B",2.1659999999999999,14,{"$f":"ROUND(+W5*$T$5,0)","v":26}]
[null,"Phone:",{"$f":"+'A-Assignment Worksheet'!D6","v":0},null,null,null,"Email:",{"$f":"+'A-Assignment Worksheet'!G6","v":0},null,null,"Date:",{"$f":"+'A-Assignment Worksheet'!G7","v":"00:00:00"},null,null,null,"Batch Payment Frequency:",null,null,null,"W",null,"M",1,30,12]
[null,"Fax:",{"$f":"+'A-Assignment Worksheet'!D7","v":0},null,null,null,"Batch ID:",{"$f":"+'I-Inputs'!B7","v":1},null,null,null,null,null,null,null,null,null,null,"Payments in Stream:",{"$f":"+$T$5*(VLOOKUP($T$6,V4:X7,2,FALSE))","v":51.996000000000002},null,"S",2,15,24]
[]
[null,null,null,null,null,null,null,null,"Payments in Stream",null,null,"Stream Advance Amount",null,null,null,null,"PAYMENTS IN STREAM ANALYSIS"]
["EX","Last Name","First Name","Year","Make","Principal Balance","Payment","Payments Year","No.","Amount","Last Payment",null,"Capital Ratio","Documents Compliant",null,null,"Next Payment Date","Payment Type","Multiplier","Payments in Stream","Max Days in Stream","Days Account is in Stream","Days Between Payments","Payments in Stream","Weekly Payments"]
{"$rows_left_out":35}