{"text_format":"1","workbook":"xlsx","n_sheets":13,"sheets":["Assignment Worksheet","B-Inputs","C-NADA Values","D-Checklist","E-Attachment To Assignment","F-Attachment Payments","Q - Internal Payments","G&K-Funding Analysis","L-Payment Schedule","M - Block Ticket","O - Customer Swaps","N - Payment Histories","SDA Instructions"],"not_rendered":{"charts":0,"images":10,"macros":1,"external_links":0,"defined_names":24,"comments":0,"pivot_tables":0},"unopened":[],"bounds":{"document_bytes":16777216,"sheet_cells":100000,"rows_first":2000,"rows_last":500,"rows_between":2000,"halvings":0,"cell_chars":16384,"cell_head_chars":4096},"cells_cut":0,"cells_raw":0,"read":"whole","date_system":"1900"}

{"sheet":"Assignment Worksheet","index":0,"n_rows":36,"n_cols":14,"rows_kept":36,"cut":false,"hidden":false,"merged":[[2,0,2,2],[4,0,4,2],[5,0,5,2],[6,0,6,2],[5,3,5,5],[6,3,6,5],[3,3,3,5],[2,3,2,5]]}
["SDA AUCTION COST RECOVERY ASSIGNMENT WORKSHEET",null,null,null,null,null,null,null,null,null,null,null,null,"Send completed worksheet to Cash@SDAinc.net"]
["(Attachment to Assignment)",null,null,null,null,null,null,null,null,null,null,null,null,"Call 404-352-9936 for assistance."]
["Dealer Name:",null,null,null,null,null,null,null,null,"Payment Types:"]
[null,null,"Address:",null,null,null,"City:",null,null,"W - Weekly"]
["State:",null,null,null,"Zip:",null,"Date:",null,null,"B - BiWeekly"]
["Phone:",null,null,null,null,null,"Email:",null,null,"M - Monthly"]
["Fax:",null,null,null,null,null,null,null,null,"S - Semimonthly"]
[]
{"$rows_left_out":29}
{"sheet":"B-Inputs","index":1,"n_rows":41,"n_cols":4,"rows_kept":41,"cut":false,"hidden":true,"merged":[[1,0,1,2]]}
["ACR Dealer Inputs"]
["Notes:\nRed Text is a variable to be completed by SDA Only.\nBlue Text is input comleted by Dealers.\nAll Black text is a formula and is automatically calculated."]
[]
["Dealer Inputs",null,"Notes","RCR Defaults"]
["Dealership Name:",{"$f":"+'Assignment Worksheet'!D3","v":0},"Copied from Dealer Completed Form","Dealer Default"]
["State:","TX","Determines Checklist Requirements"]
["Batch #:",7]
["Batch ID:","RCR1"]
{"$rows_left_out":34}
{"sheet":"C-NADA Values","index":2,"n_rows":35,"n_cols":11,"rows_kept":35,"cut":false,"hidden":true,"merged":[[9,8,9,10],[2,0,2,2],[4,0,4,2],[4,4,4,6],[5,0,5,2],[6,0,6,2]]}
["NADA Values"]
[]
["Dealership Name:",null,null,{"$f":"+'Assignment Worksheet'!D3","v":0},null,null,"Batch #:",{"$f":"+'B-Inputs'!B7","v":7}]
[null,null,"Address:",{"$f":"+'Assignment Worksheet'!D4","v":0},null,null,"City:",{"$f":"+'Assignment Worksheet'!H4","v":0}]
["State:",null,null,{"$f":"+'Assignment Worksheet'!D5","v":0}]
["Phone:",null,null,{"$f":"+'Assignment Worksheet'!D6","v":0}]
["Fax:",null,null,{"$f":"+'Assignment Worksheet'!D7","v":0}]
[]
{"$rows_left_out":28}
{"sheet":"D-Checklist","index":3,"n_rows":35,"n_cols":19,"rows_kept":35,"cut":false,"hidden":true,"merged":[[6,9,6,10],[7,0,7,2],[7,4,7,6],[7,9,7,10],[3,0,3,2],[3,9,3,10],[4,0,4,2],[4,9,4,10],[5,0,5,2],[6,0,6,2],[6,4,6,6],[3,3,3,5]]}
["SDA Account Checklist"]
[]
[]
["Dealership Name:",null,null,{"$f":"+'Assignment Worksheet'!D3:H3","v":0},null,null,"Batch #:",{"$f":"+'B-Inputs'!B7","v":7}]
[]
[]
[]
[]
{"$rows_left_out":28}
{"sheet":"E-Attachment To Assignment","index":4,"n_rows":43,"n_cols":15,"rows_kept":43,"cut":false,"hidden":true,"merged":[[6,7,6,9],[2,0,2,2],[4,0,4,2],[5,0,5,2],[6,0,6,2],[3,3,3,5],[4,3,4,5],[5,3,5,5],[6,3,6,5],[2,3,2,5]]}
["ATTACHMENT TO ASSIGNMENT DATED:",null,null,null,null,null,null,{"$f":"+'B-Inputs'!$B$38","v":"2018-05-04"}]
[]
["Dealership Name:",null,null,{"$f":"+'Assignment Worksheet'!D3","v":0},null,null,"Batch #:",{"$f":"+'B-Inputs'!B7","v":7}]
[null,null,"Address:",{"$f":"+'Assignment Worksheet'!D4","v":0}]
["City:",null,null,{"$f":"+'Assignment Worksheet'!H4","v":0},null,null,"State:",{"$f":"+'Assignment Worksheet'!D5","v":0}]
["Phone:",null,null,{"$f":"+'Assignment Worksheet'!D6","v":0},null,null,"Zip:",{"$f":"+'Assignment Worksheet'!F5","v":0}]
["Fax:",null,null,{"$f":"+'Assignment Worksheet'!D7","v":0},null,null,"Email:",{"$f":"+'Assignment Worksheet'!H6","v":0}]
[]
{"$rows_left_out":36}
{"sheet":"F-Attachment Payments","index":5,"n_rows":140,"n_cols":5,"rows_kept":140,"cut":false,"hidden":true,"merged":[]}
["ATTACHMENT TO ASSIGNMENT DATED:",null,null,{"$f":"+'B-Inputs'!$B$38","v":"2018-05-04"}]
["Payment Schedule"]
["Dealer Name:",{"$f":"+'Assignment Worksheet'!D3","v":0},"Batch #:",{"$f":"+'B-Inputs'!B7","v":7}]
["Address:",{"$f":"+'Assignment Worksheet'!D4","v":0}]
["City:",{"$f":"+'Assignment Worksheet'!H4","v":0},"Phone:",{"$f":"+'Assignment Worksheet'!D6","v":0}]
["State:",{"$f":"+'Assignment Worksheet'!D5","v":0},"Fax:",{"$f":"IF('Assignment Worksheet'!D7>0,+'Assignment Worksheet'!D7:F7,\"\")","v":""}]
["Zip:",{"$f":"+'Assignment Worksheet'!F5","v":0},"Email:"]
[]
{"$rows_left_out":133}
{"sheet":"Q - Internal Payments","index":6,"n_rows":140,"n_cols":7,"rows_kept":140,"cut":false,"hidden":true,"merged":[]}
["INTERNAL ONLY - PAYMENT/ACH SCHEDULE",null,null,null,null,{"$f":"+'B-Inputs'!$B$38","v":"2018-05-04"}]
[]
["Dealer Name:",{"$f":"+'Assignment Worksheet'!D3","v":0},"Batch #:",null,null,{"$f":"+'B-Inputs'!B7","v":7}]
["Address:",{"$f":"+'Assignment Worksheet'!D4","v":0}]
["City:",{"$f":"+'Assignment Worksheet'!H4","v":0},"Phone:",null,null,{"$f":"+'Assignment Worksheet'!D6","v":0}]
["State:",{"$f":"+'Assignment Worksheet'!D5","v":0},"Fax:",null,null,{"$f":"IF('Assignment Worksheet'!D7>0,+'Assignment Worksheet'!D7:F7,\"\")","v":""}]
["Zip:",{"$f":"+'Assignment Worksheet'!F5","v":0},"Email:"]
[]
{"$rows_left_out":133}
{"sheet":"G&K-Funding Analysis","index":7,"n_rows":35,"n_cols":38,"rows_kept":35,"cut":false,"hidden":true,"merged":[[6,0,6,2],[3,3,3,7],[4,9,4,10],[6,9,6,10],[7,0,7,2],[6,4,6,6],[3,0,3,2],[3,9,3,10],[4,0,4,2],[5,0,5,2],[7,35,7,36],[7,17,7,19],[7,4,7,6],[7,9,7,10],[7,27,7,33],[7,20,7,24],[2,26,2,27],[6,16,6,18],[6,20,6,22],[7,25,7,26],[3,29,3,30],[4,26,4,27],[5,26,5,27],[3,16,3,18],[4,16,4,18],[5,16,5,18],[6,12,6,13],[9,17,9,19],[2,16,2,18],[2,19,2,24],[5,20,5,22],[5,12,5,13]]}
["SDA INTERNAL ANALYSIS FUNDING ANALYSIS",null,null,null,null,null,null,null,null,null,null,null,null,null,null,null,"SDA Funding Basis and Term Analysis"]
[]
[null,null,null,null,null,null,null,null,null,null,null,null,null,null,null,null,"Dealership Name:",null,null,{"$f":"+'Assignment Worksheet'!Q2:U2","v":0},null,null,null,null,null,null,"Low Basis Term Cap:",null,{"$f":"+'B-Inputs'!$B$26","v":5000},null,"Max Auction Date:",{"$f":"+'B-Inputs'!$B$30","v":90}]
["Dealership Name:",null,null,{"$f":"+'Assignment Worksheet'!D3:H3","v":0},null,null,null,null,null,null,null,null,null,null,null,null,"NADA %:",null,null,{"$f":"+'B-Inputs'!$B$15","v":1.25},"Monthly Advance Fee:",null,null,null,{"$f":"+'B-Inputs'!$B$21","v":1.2500000000000001E-2},null,"Low Basis Term Cap Weeks:",null,{"$f":"+'B-Inputs'!$B$27*4.333","v":103.992},"Min Funding Weeks:",null,{"$f":"+'B-Inputs'!R30","v":0}]
["NADA %:",null,null,{"$f":"+'B-Inputs'!$B$15","v":1.25},"Monthly Advance Fee:",null,null,{"$f":"+'B-Inputs'!$B$21","v":1.2500000000000001E-2},null,"Low Basis Term Cap:",null,{"$f":"+'B-Inputs'!$B$26","v":5000},null,"Max Auction Date:",{"$f":"+'B-Inputs'!$B$30","v":90},null,"Customer Principal %:",null,null,{"$f":"+'B-Inputs'!$B$17","v":0.65},"Weekly Advance Fee:",null,null,null,{"$f":"+'B-Inputs'!B22","v":2.8848372951765519E-3},null,"Term Reduction:",null,{"$f":"+'B-Inputs'!$B$25","v":6}]
["Customer Principal %:",null,null,{"$f":"+'B-Inputs'!$B$17","v":0.65},"Weekly Advance Fee:",null,null,{"$f":"+'B-Inputs'!$B$22","v":2.8848372951765519E-3},null,"Low Basis Term Cap Weeks:",null,{"$f":"+'B-Inputs'!$B$27*4.333","v":103.992},"Min Funding Weeks:",null,{"$f":"+'B-Inputs'!B33","v":26},null,"Advance Fee %:",null,null,{"$f":"+'B-Inputs'!$B$18","v":7.0000000000000007E-2},"MAX Advance Fee:",null,null,null,{"$f":"+'B-Inputs'!$B$19","v":700},null,"Payoff Per Account:",null,{"$f":"+'B-Inputs'!$B$29","v":99}]
["Advance Fee %:",null,null,{"$f":"+'B-Inputs'!$B$18","v":7.0000000000000007E-2},"MAX Advance Fee:",null,null,{"$f":"+'B-Inputs'!$B$19","v":700},null,"Term Reduction:",null,{"$f":"+'B-Inputs'!$B$25","v":6},"Max Term Weeks:",null,{"$f":"+'B-Inputs'!B24","v":129.99},null,"Max Funding Basis:",null,null,{"$f":"+'B-Inputs'!$B$20","v":10000},"Max Term Months:",null,null,null,{"$f":"+'B-Inputs'!$B$23","v":30}]
["Max Funding Basis:",null,null,{"$f":"+'B-Inputs'!$B$20","v":10000},"Max Term Months:",null,null,{"$f":"+'B-Inputs'!$B$23","v":30},null,"Payoff Per Account:",null,{"$f":"+'B-Inputs'!$B$29","v":99},null,null,null,null,null,"Compliance",null,null,"Funding Basis Values",null,null,null,null,"Auction Compliance",null,"Term Conversion to Weeks",null,null,null,null,null,null,"ACTUAL","Load Fee"]
{"$rows_left_out":28}
{"sheet":"L-Payment Schedule","index":8,"n_rows":36,"n_cols":407,"rows_kept":36,"cut":false,"hidden":true,"merged":[[2,0,2,2],[4,0,4,2],[4,4,4,6],[5,0,5,2],[6,0,6,2]]}
["Payment Schedule Worksheet"]
[]
["Dealership Name:",null,null,{"$f":"+'Assignment Worksheet'!D3","v":0},null,null,"Batch #:",{"$f":"+'B-Inputs'!B7","v":7}]
[null,null,"Address:",{"$f":"+'Assignment Worksheet'!D4","v":0},null,null,"City:",{"$f":"+'Assignment Worksheet'!H4","v":0}]
["State:",null,null,{"$f":"+'Assignment Worksheet'!D5","v":0},null,null,null,null,null,null,null,null,null,null,null,"Funding Date:",null,null,{"$f":"+'B-Inputs'!$B$38","v":"2018-05-04"}]
["Phone:",null,null,{"$f":"+'Assignment Worksheet'!D6","v":0},null,null,null,null,null,null,null,null,null,null,null,"Days Till First Payment:",null,null,{"$f":"+'B-Inputs'!$B$39","v":14}]
["Fax:",null,null,{"$f":"+'Assignment Worksheet'!D7","v":0},null,null,null,null,null,null,null,null,null,null,null,"Payment Frequency",null,null,{"$f":"+'B-Inputs'!$B$41","v":7}]
[null,null,null,null,null,null,null,null,null,null,null,null,null,null,null,"Total Payment",null,null,null,null,null,null,null,null,null,null,null,null,null,null,null,null,null,null,null,null,null,null,null,null,null,null,null,null,null,null,null,null,null,null,null,null,null,null,null,null,null,null,null,null,null,null,null,null,null,null,null,null,null,null,null,null,null,null,null,null,null,null,null,null,null,null,null,null,null,null,null,null,null,null,null,null,null,null,null,null,null,null,null,null,null,null,null,null,null,null,null,null,null,null,null,null,null,null,null,null,null,null,null,null,null,null,null,null,null,null,null,null,null,null,null,null,null,null,null,null,null,null,null,null,null,null,null,null,null,null,"PRINCIPAL",null,null,null,null,null,null,null,null,null,null,null,null,null,null,null,null,null,null,null,null,null,null,null,null,null,null,null,null,null,null,null,null,null,null,null,null,null,null,null,null,null,null,null,null,null,null,null,null,null,null,null,null,null,null,null,null,null,null,null,null,null,null,null,null,null,null,null,null,null,null,null,null,null,null,null,null,null,null,null,null,null,null,null,null,null,null,null,null,null,null,null,null,null,null,null,null,null,null,null,null,null,null,null,null,null,null,null,null,null,null,null,null,null,null,null,null,null,null,null,null,null,null,null,null,null,null,null,null,null,null,"INTEREST"]
{"$rows_left_out":29}
{"sheet":"M - Block Ticket","index":9,"n_rows":36,"n_cols":14,"rows_kept":36,"cut":false,"hidden":true,"merged":[[6,9,6,11],[2,6,6,8],[7,10,7,11],[1,4,1,6],[2,9,2,11],[3,9,3,11],[4,9,4,11],[5,9,5,11]]}
["Block Ticket",null,null,null,null,null,null,"Batch #:",{"$f":"+'B-Inputs'!B7","v":7},null,{"$f":"+'B-Inputs'!$B$38","v":"2018-05-04"}]
[" Dealership Name:",null,null,null,{"$f":"+'Assignment Worksheet'!D3","v":0}]
[null,null,null,null,"Date Funded:",null,"Notes:",null,null,"Total Purchase Amount:",null,null,{"$f":"+H36","v":5250}]
[null,null,null,null,"QuickBooks:",null,null,null,null,"Less Administrative Cost:",null,null,{"$f":"-L36","v":-367.50000000000006}]
["OFFICE USE ONLY:",null,null,null,"ICN #:",null,null,null,null,"Less Title Escrow:",null,null,{"$f":"-M36","v":0}]
[null,null,null,null,"Sales Comm. Updated:",null,null,null,null,"Less Wire Fee:",null,null,{"$f":"-'B-Inputs'!B34","v":0}]
[null,null,null,null,"Act Updated:",null,null,null,null,"Total to Be Deducted:",null,null,{"$f":"SUM(M4:M6)","v":-367.50000000000006}]
[null,null,null,null,null,null,null,null,null,null,"Total Funding Amount:",null,{"$f":"+M3+M7","v":4882.5}]
{"$rows_left_out":29}
{"sheet":"O - Customer Swaps","index":10,"n_rows":41,"n_cols":18,"rows_kept":41,"cut":false,"hidden":true,"merged":[[5,0,5,2],[5,3,5,5],[2,0,2,2],[2,3,2,5],[3,3,3,5],[4,0,4,2],[4,3,4,5],[9,14,9,15],[6,0,6,2],[6,3,6,5],[6,10,6,12],[9,6,9,7],[9,4,9,5],[9,0,9,3],[9,8,9,9],[9,10,9,11],[9,12,9,13]]}
["CUSTOMER CHANGE REPORT"]
[]
["Dealership Name:",null,null,{"$f":"+'Assignment Worksheet'!D3","v":0},null,null,null,null,null,"Batch #:",{"$f":"+'B-Inputs'!B7","v":7}]
[null,null,"Address:",{"$f":"+'Assignment Worksheet'!D4","v":0}]
["City:",null,null,{"$f":"+'Assignment Worksheet'!H4","v":0},null,null,null,null,null,"State:",{"$f":"+'Assignment Worksheet'!D5","v":0}]
["Phone:",null,null,{"$f":"+'Assignment Worksheet'!D6","v":0},null,null,null,null,null,"Zip:",{"$f":"+'Assignment Worksheet'!F5","v":0}]
["Fax:",null,null,{"$f":"+'Assignment Worksheet'!D7","v":0},null,null,null,null,null,"Email:",{"$f":"+'Assignment Worksheet'!H6","v":0}]
[]
{"$rows_left_out":34}
{"sheet":"N - Payment Histories","index":11,"n_rows":35,"n_cols":136,"rows_kept":35,"cut":false,"hidden":true,"merged":[[6,0,6,2],[8,0,8,5],[4,6,4,8],[5,6,5,8],[2,0,2,2],[4,0,4,2],[4,4,4,5],[5,0,5,2]]}
["Payment Histories Worksheet"]
[]
["Dealership Name:",null,null,{"$f":"+'Assignment Worksheet'!D3","v":0},null,null,null,null,"Batch #:",{"$f":"+'B-Inputs'!B7","v":7}]
[null,null,"Address:",{"$f":"+'Assignment Worksheet'!D4","v":0},null,null,null,null,"City:",{"$f":"+'Assignment Worksheet'!H4","v":0}]
["State:",null,null,{"$f":"+'Assignment Worksheet'!D5","v":0},null,null,"First payment Date:",null,null,{"$f":"+'B-Inputs'!B40","v":"2018-05-18"}]
["Phone:",null,null,{"$f":"+'Assignment Worksheet'!D6","v":0},null,null,"Payment Frequency:",null,null,{"$f":"+'B-Inputs'!$B$41","v":7}]
["Fax:",null,null,{"$f":"+'Assignment Worksheet'!D7","v":0}]
[]
{"$rows_left_out":28}
{"sheet":"SDA Instructions","index":12,"n_rows":49,"n_cols":4,"rows_kept":49,"cut":false,"hidden":true,"merged":[]}
["Instructions for RCR Program"]
["SDA Instructions:"]
["Steps","Instructions","Responsibility","Notes"]
[1,"Salesman and SDA team will jointly decide when it is time to send the PHASE 1 materials for the RCR Program.","Sales Team and Margaret","Send Cover Sheet, Program Details"]
[2,"Follow normal SDA Dealer application procedures for any NEW dealers.","Sales Team and Margaret","Use Same Dealer Application Process"]
[3,"If Dealer has never completed an RCR batch previously, they must complete a new Dealer Agreement and associated Addendum.  Documents to be sent to dealer (via email) should include:\n- RCR Cover Letter\n- RCR Dealer Agreement\n- Addendum A Updatede with Negotiated Terms from Loan Committee\n- Assignment Agreement\n- Irrevocable Power of Attorney\n- Guaranty and Indemnity Agreement\n- Purchase Affirmation with Updated Batch Number\n- Certificate of Authority\n- DMS and GPS Contract Addendum\n- Title Escrow Agreement\n","Margaret, Anddrea, or Kevin","Templates are located in RCR Folder in Shared Drive"]
[4,"If Dealer is a returning RCR customer, only send the RCR Electronic Worksheet as described below.","SDA Team","Send \"RCR Assignment Worksheet: from RCR Folder on Shared Drive."]
[5,"When appropriate, send the RCR Electronic Worksheet and ask Dealer to complete the Assignment Worksheet Tab.  Verify that all other tabs are hidden.","SDA Team","Send \"RCR Assignment Worksheet: from RCR Folder on Shared Drive."]
{"$rows_left_out":41}